Target
Epidermal growth factor receptor [1-249,301-1210,T790M,L858R]
Ligand
BDBM202375
Substrate
IC50
5.50±n/a nM
Citation
 Lee, KNiu, DPetter, RCSingh, J Heteroaryl compounds and uses thereof US Patent  US9765038 Publication Date 9/19/2017 
Target
Name:
Epidermal growth factor receptor [1-249,301-1210,T790M,L858R]
Synonyms:
EGFR ERBB Epidermal growth factor receptor (T790M/L858R) | HER1
Type:
Receptor Kinase Domain
Mol. Mass.:
128584.06
Organism:
Homo sapiens (Human)
Description:
P00533[1-249,301-1210,T790M,L858R]
Residue:
1160
  
Inhibitor
Name:
BDBM202375
Synonyms:
US10081606, Compound I-7 US9765038, Compound I-7
Type:
Small organic molecule
Emp. Form.:
C22H21ClN4O5
Mol. Mass.:
456.879
SMILES:
COc1ccc(Nc2ncc(Cl)c(Oc3cccc(NC(=O)C=C)c3)n2)c(OC)c1OC
: