Target
Epidermal growth factor receptor
Ligand
BDBM202384
Substrate
Meas. Tech.
Biochemical Assay
IC50
200±n/a nM
Citation
 Lee, KNiu, DPetter, RCSingh, J Heteroaryl compounds and uses thereof US Patent  US9765038 Publication Date 9/19/2017 
Target
Name:
Epidermal growth factor receptor
Synonyms:
EGF Receptor Substrate EGFR_HUMAN ERBB1 Epidermal Growth Factor Receptor erbB-1 Epidermal growth factor receptor (EGFR) HER1 Proto-oncogene c-ErbB-1 Tyrosine-Protein Kinase ErbB-1
Type:
Receptor Kinase Domain
Mol. Mass.:
134279.59
Organism:
Homo sapiens (Human)
Description:
P00533
Residue:
1210
  
Inhibitor
Name:
BDBM202384
Synonyms:
US10081606, Compound I-16 US9765038, Compound I-16
Type:
Small organic molecule
Emp. Form.:
C22H20F3N5O3
Mol. Mass.:
459.4211
SMILES:
COc1cccc(Nc2ncc(c(Nc3cccc(NC(=O)C=C)c3)n2)C(F)(F)F)c1OC
: