Target
11-beta-hydroxysteroid dehydrogenase 1
Ligand
BDBM340798
Substrate
Meas. Tech.
Inhibition Assay
IC50
26.0±n/a nM
Citation
 Kiso, TTsukamoto, M Therapeutic agent for pain US Patent  US9765040 Publication Date 9/19/2017 
Target
Name:
11-beta-hydroxysteroid dehydrogenase 1
Synonyms:
11-DH 11-beta-Hydroxysteroid Dehydrogenase 1 (11-beta-HSD1) Corticosteroid 11-beta-dehydrogenase isozyme 1 DHI1_RAT Hsd11b1
Type:
Enzyme
Mol. Mass.:
31889.48
Organism:
Rattus norvegicus (rat)
Description:
P16232
Residue:
288
  
Inhibitor
Name:
BDBM340798
Synonyms:
US9765040, Compound 9
Type:
Small organic molecule
Emp. Form.:
C21H21F3N4O2
Mol. Mass.:
418.4122
SMILES:
CC(C)n1c(nnc1C(C)(C)Oc1c(F)cc(F)cc1F)-c1ccc(cc1)C(N)=O
: