Target
11-beta-hydroxysteroid dehydrogenase 1
Ligand
BDBM340799
Substrate
Meas. Tech.
Inhibition Assay
IC50
135±n/a nM
Citation
 Kiso, TTsukamoto, M Therapeutic agent for pain US Patent  US9765040 Publication Date 9/19/2017 
Target
Name:
11-beta-hydroxysteroid dehydrogenase 1
Synonyms:
11-DH 11-beta-Hydroxysteroid Dehydrogenase 1 (11-beta-HSD1) Corticosteroid 11-beta-dehydrogenase isozyme 1 DHI1_RAT Hsd11b1
Type:
Enzyme
Mol. Mass.:
31889.48
Organism:
Rattus norvegicus (rat)
Description:
P16232
Residue:
288
  
Inhibitor
Name:
BDBM340799
Synonyms:
US9765040, Compound 10
Type:
Small organic molecule
Emp. Form.:
C19H16ClF3N4O2
Mol. Mass.:
424.804
SMILES:
Cn1c(nnc1C(C)(C)Oc1c(F)cc(Cl)cc1F)-c1ccc(cc1F)C(N)=O
: