Target
cGMP-dependent 3',5'-cyclic phosphodiesterase
Ligand
BDBM204143
Substrate
Meas. Tech.
Inhibition of Recombinant PDE2A
IC50
12±n/a nM
Citation
 Lankau, HLangen, BGrunwald, CHoefgen, NStange, HDost, REgerland, U (1,2,4)triazolo[4,3-A]quinoxaline derivatives as inhibitors of phosphodiesterases US Patent  US9540379 Publication Date 1/10/2017 
Target
Name:
cGMP-dependent 3',5'-cyclic phosphodiesterase
Synonyms:
CGS-PDE Homo sapiens phosphodiesterase 2A (PDE2A) PDE2A cGSPDE
Type:
Enzyme Catalytic Domain
Mol. Mass.:
105691.58
Organism:
Homo sapiens (Human)
Description:
O00408
Residue:
941
  
Inhibitor
Name:
BDBM204143
Synonyms:
8-chloro-4-methyl-1-o-tolyl-[1,2,4]triazolo[4,3-a]quinoxaline | US9540379, 8
Type:
Small organic molecule
Emp. Form.:
C17H13ClN4
Mol. Mass.:
308.765
SMILES:
Cc1ccccc1-c1nnc2c(C)nc3ccc(Cl)cc3n12
: