Target
cGMP-dependent 3',5'-cyclic phosphodiesterase
Ligand
BDBM50085693
Substrate
Meas. Tech.
Inhibition of Recombinant PDE2A
IC50
5.00±n/a nM
Citation
 Lankau, HLangen, BGrunwald, CHoefgen, NStange, HDost, REgerland, U (1,2,4)triazolo[4,3-A]quinoxaline derivatives as inhibitors of phosphodiesterases US Patent  US9540379 Publication Date 1/10/2017 
Target
Name:
cGMP-dependent 3',5'-cyclic phosphodiesterase
Synonyms:
CGS-PDE Homo sapiens phosphodiesterase 2A (PDE2A) PDE2A cGSPDE
Type:
Enzyme Catalytic Domain
Mol. Mass.:
105691.58
Organism:
Homo sapiens (Human)
Description:
O00408
Residue:
941
  
Inhibitor
Name:
BDBM50085693
Synonyms:
CHEMBL1915969 | US9540379, 32
Type:
Small organic molecule
Emp. Form.:
C16H11ClN4
Mol. Mass.:
294.738
SMILES:
Cc1nc2ccccc2n2c(nnc12)-c1ccccc1Cl
: