Target
cGMP-dependent 3',5'-cyclic phosphodiesterase
Ligand
BDBM204632
Substrate
Meas. Tech.
Inhibition of Recombinant PDE2A
IC50
6.00±n/a nM
Citation
 Lankau, HLangen, BGrunwald, CHoefgen, NStange, HDost, REgerland, U (1,2,4)triazolo[4,3-A]quinoxaline derivatives as inhibitors of phosphodiesterases US Patent  US9540379 Publication Date 1/10/2017 
Target
Name:
cGMP-dependent 3',5'-cyclic phosphodiesterase
Synonyms:
CGS-PDE Homo sapiens phosphodiesterase 2A (PDE2A) PDE2A cGSPDE
Type:
Enzyme Catalytic Domain
Mol. Mass.:
105691.58
Organism:
Homo sapiens (Human)
Description:
O00408
Residue:
941
  
Inhibitor
Name:
BDBM204632
Synonyms:
1-[2-chloro-5-(4,4,4-trifluoro-butoxy)-phenyl]-4-methyl-[1,2,4]triazolo[4,3-a]quinoxaline | US9540379, 45
Type:
Small organic molecule
Emp. Form.:
C20H16ClF3N4O
Mol. Mass.:
420.815
SMILES:
Cc1nc2ccccc2n2c(nnc12)-c1cc(OCCCC(F)(F)F)ccc1Cl
: