Target
cGMP-dependent 3',5'-cyclic phosphodiesterase
Ligand
BDBM204647
Substrate
Meas. Tech.
Inhibition of Recombinant PDE2A
IC50
17±n/a nM
Citation
 Lankau, HLangen, BGrunwald, CHoefgen, NStange, HDost, REgerland, U (1,2,4)triazolo[4,3-A]quinoxaline derivatives as inhibitors of phosphodiesterases US Patent  US9540379 Publication Date 1/10/2017 
Target
Name:
cGMP-dependent 3',5'-cyclic phosphodiesterase
Synonyms:
CGS-PDE Homo sapiens phosphodiesterase 2A (PDE2A) PDE2A cGSPDE
Type:
Enzyme Catalytic Domain
Mol. Mass.:
105691.58
Organism:
Homo sapiens (Human)
Description:
O00408
Residue:
941
  
Inhibitor
Name:
BDBM204647
Synonyms:
1-(2-chloro-5-methoxy-phenyl)-8-fluoro-4-methyl-[1,2,4]triazolo[4,3-a]quinoxaline | US9540379, 56
Type:
Small organic molecule
Emp. Form.:
C17H12ClFN4O
Mol. Mass.:
342.755
SMILES:
COc1ccc(Cl)c(c1)-c1nnc2c(C)nc3ccc(F)cc3n12
: