Target
cGMP-dependent 3',5'-cyclic phosphodiesterase
Ligand
BDBM204673
Substrate
Meas. Tech.
Inhibition of Recombinant PDE2A
IC50
9.00±n/a nM
Citation
 Lankau, HLangen, BGrunwald, CHoefgen, NStange, HDost, REgerland, U (1,2,4)triazolo[4,3-A]quinoxaline derivatives as inhibitors of phosphodiesterases US Patent  US9540379 Publication Date 1/10/2017 
Target
Name:
cGMP-dependent 3',5'-cyclic phosphodiesterase
Synonyms:
CGS-PDE Homo sapiens phosphodiesterase 2A (PDE2A) PDE2A cGSPDE
Type:
Enzyme Catalytic Domain
Mol. Mass.:
105691.58
Organism:
Homo sapiens (Human)
Description:
O00408
Residue:
941
  
Inhibitor
Name:
BDBM204673
Synonyms:
1-(2-chloro-phenyl)-7-methoxy-4-methyl-[1,2,4]triazolo[4,3-a]quinoxaline | US9540379, 74
Type:
Small organic molecule
Emp. Form.:
C17H13ClN4O
Mol. Mass.:
324.764
SMILES:
COc1ccc2c(c1)nc(C)c1nnc(-c3ccccc3Cl)n21
: