Target
cGMP-dependent 3',5'-cyclic phosphodiesterase
Ligand
BDBM204679
Substrate
Meas. Tech.
Inhibition of Recombinant PDE2A
IC50
7.00±n/a nM
Citation
 Lankau, HLangen, BGrunwald, CHoefgen, NStange, HDost, REgerland, U (1,2,4)triazolo[4,3-A]quinoxaline derivatives as inhibitors of phosphodiesterases US Patent  US9540379 Publication Date 1/10/2017 
Target
Name:
cGMP-dependent 3',5'-cyclic phosphodiesterase
Synonyms:
CGS-PDE Homo sapiens phosphodiesterase 2A (PDE2A) PDE2A cGSPDE
Type:
Enzyme Catalytic Domain
Mol. Mass.:
105691.58
Organism:
Homo sapiens (Human)
Description:
O00408
Residue:
941
  
Inhibitor
Name:
BDBM204679
Synonyms:
1-(2-chloro-phenyl)-7-[2-(3,4-dimethoxy-phenyl)-ethoxy]-4-methyl-[1,2,4]triazolo[4,3-a]quinoxaline | US9540379, 78
Type:
Small organic molecule
Emp. Form.:
C26H23ClN4O3
Mol. Mass.:
474.939
SMILES:
COc1ccc(CCOc2ccc3c(c2)nc(C)c2nnc(-c4ccccc4Cl)n32)cc1OC
: