Target
cGMP-dependent 3',5'-cyclic phosphodiesterase
Ligand
BDBM204686
Substrate
Meas. Tech.
Inhibition of Recombinant PDE2A
IC50
3.00±n/a nM
Citation
 Lankau, HLangen, BGrunwald, CHoefgen, NStange, HDost, REgerland, U (1,2,4)triazolo[4,3-A]quinoxaline derivatives as inhibitors of phosphodiesterases US Patent  US9540379 Publication Date 1/10/2017 
Target
Name:
cGMP-dependent 3',5'-cyclic phosphodiesterase
Synonyms:
CGS-PDE Homo sapiens phosphodiesterase 2A (PDE2A) PDE2A cGSPDE
Type:
Enzyme Catalytic Domain
Mol. Mass.:
105691.58
Organism:
Homo sapiens (Human)
Description:
O00408
Residue:
941
  
Inhibitor
Name:
BDBM204686
Synonyms:
8-bromo-1-(5-butoxy-2-fluoro-phenyl)-4-methyl-[1,2,4]triazolo[4,3-a]quinoxaline | US9540379, 84
Type:
Small organic molecule
Emp. Form.:
C20H18BrFN4O
Mol. Mass.:
429.286
SMILES:
CCCCOc1ccc(F)c(c1)-c1nnc2c(C)nc3ccc(Br)cc3n12
: