Target
cGMP-dependent 3',5'-cyclic phosphodiesterase
Ligand
BDBM204690
Substrate
Meas. Tech.
Inhibition of Recombinant PDE2A
IC50
8.00±n/a nM
Citation
 Lankau, HLangen, BGrunwald, CHoefgen, NStange, HDost, REgerland, U (1,2,4)triazolo[4,3-A]quinoxaline derivatives as inhibitors of phosphodiesterases US Patent  US9540379 Publication Date 1/10/2017 
Target
Name:
cGMP-dependent 3',5'-cyclic phosphodiesterase
Synonyms:
CGS-PDE Homo sapiens phosphodiesterase 2A (PDE2A) PDE2A cGSPDE
Type:
Enzyme Catalytic Domain
Mol. Mass.:
105691.58
Organism:
Homo sapiens (Human)
Description:
O00408
Residue:
941
  
Inhibitor
Name:
BDBM204690
Synonyms:
7-bromo-1-(5-butoxy-2-chloro-phenyl)-4-methyl-[1,2,4]triazolo[4,3-a]quinoxaline | US9540379, 88
Type:
Small organic molecule
Emp. Form.:
C21H19ClN4O2
Mol. Mass.:
394.854
SMILES:
Cc1nc2ccccc2n2c(nnc12)-c1cc(OC(=O)C(C)(C)C)ccc1Cl
: