Target
Protein arginine N-methyltransferase 5
Ligand
BDBM337146
Substrate
Meas. Tech.
Biochemical Assay
IC50
550±n/a nM
Citation
 Duncan, KWChesworth, RBoriack-Sjodin, PAMunchhof, MJJin, L PRMT5 inhibitors and uses thereof US Patent  US9765068 Publication Date 9/19/2017 
Target
Name:
Protein arginine N-methyltransferase 5
Synonyms:
72 kDa ICln-binding protein HRMT1L5 IBP72 Jak-binding protein 1 PRMT5/MEP50 complex Protein arginine methyltransferase 5 (PRMT5) SKB1 homolog Shk1 kinase-binding protein 1 homolog
Type:
Enzyme
Mol. Mass.:
72679.99
Organism:
Homo sapiens (Human)
Description:
O14744
Residue:
637
  
Inhibitor
Name:
BDBM337146
Synonyms:
US9745291, Compound 192 | US9765068, Compound 192
Type:
Small organic molecule
Emp. Form.:
C22H26N4O2
Mol. Mass.:
378.4674
SMILES:
O[C@H](CNC(=O)CCc1nc2ccccc2[nH]1)CN1CCc2ccccc2C1
: