Target
Urokinase-type plasminogen activator
Ligand
BDBM14350
Substrate
BDBM13949
Meas. Tech.
Enzyme Assay and Determination of the Inhibition Constants
Ki
33±n/a nM
Citation
 Katz, BAElrod, KVerner, EMackman, RLLuong, CShrader, WDSendzik, MSpencer, JRSprengeler, PAKolesnikov, ATai, VWHui, HCBreitenbucher, JGAllen, DJanc, JW Elaborate manifold of short hydrogen bond arrays mediating binding of active site-directed serine protease inhibitors. J Mol Biol 329:93-120 (2003)  
Target
Name:
Urokinase-type plasminogen activator
Synonyms:
3.4.21.73 U-plasminogen activator Urokinase Urokinase-type plasminogen activator chain B Urokinase-type plasminogen activator short chain A uPA
Type:
Enzyme
Mol. Mass.:
48528.62
Organism:
Homo sapiens (Human)
Description:
P00749
Residue:
431
  
Inhibitor
Name:
BDBM14350
Synonyms:
2-{5-[amino(iminiumyl)methyl]-6-fluoro-1H-1,3-benzodiazol-2-yl}-6-{[(1S,2S)-2-methylcyclohexyl]oxy}benzen-1-olate CRA-11092
Type:
Small organic molecule
Emp. Form.:
C21H23FN4O2
Mol. Mass.:
382.4313
SMILES:
C[C@H]1CCCC[C@@H]1Oc1cccc(-c2nc3cc(C(N)=[NH2+])c(F)cc3[nH]2)c1[O-]
:
Substrate
Name:
BDBM13949
Synonyms:
(2S)-5-carbamimidamido-N-(4-nitrophenyl)-2-{2-[(2S)-2-(phenylformamido)propanamido]acetamido}pentanamide uPA Chromogenic Substrate
Type:
Small organic molecule
Emp. Form.:
C24H30N8O6
Mol. Mass.:
526.545
SMILES:
[#6]-[#6@H](-[#7]-[#6](=O)-c1ccccc1)-[#6](=O)-[#7]-[#6]-[#6](=O)-[#7]-[#6@@H](-[#6]-[#6]-[#6]\[#7]=[#6](\[#7])-[#7])-[#6](=O)-[#7]-c1ccc(cc1)-[#7+](-[#8-])=O
: