Target
Coagulation factor X
Ligand
BDBM14338
Substrate
BDBM13950
Meas. Tech.
Enzyme Assay and Determination of the Inhibition Constants
Ki
13±n/a nM
Citation
 Katz, BAElrod, KVerner, EMackman, RLLuong, CShrader, WDSendzik, MSpencer, JRSprengeler, PAKolesnikov, ATai, VWHui, HCBreitenbucher, JGAllen, DJanc, JW Elaborate manifold of short hydrogen bond arrays mediating binding of active site-directed serine protease inhibitors. J Mol Biol 329:93-120 (2003)  
Target
Name:
Coagulation factor X
Synonyms:
Activated coagulation factor X (FXa) Coagulation factor X precursor F10 Factor X heavy chain Factor Xa Stuart-Prower factor
Type:
Enzyme
Mol. Mass.:
54726.60
Organism:
Homo sapiens (Human)
Description:
Residue:
488
  
Inhibitor
Name:
BDBM14338
Synonyms:
2-{5-[amino(iminiumyl)methyl]-1H-indol-2-yl}-4-nitro-6-phenylbenzen-1-olate | CRA-15566
Type:
Small organic molecule
Emp. Form.:
C21H16N4O3
Mol. Mass.:
372.3767
SMILES:
NC(=[NH2+])c1ccc2[nH]c(cc2c1)-c1cc(cc(-c2ccccc2)c1[O-])[N+]([O-])=O
:
Substrate
Name:
BDBM13950
Synonyms:
(2S)-N-({[(1S)-4-carbamimidamido-1-[(4-nitrophenyl)carbamoyl]butyl]carbamoyl}methyl)-2-acetamidohexanamide Factor Xa (fXa) Chromogenic Substrate
Type:
Emp. Form.:
Mol. Mass.:
SMILES:
: