Target
Ribosomal protein S6 kinase alpha-2
Ligand
BDBM286080
Substrate
Meas. Tech.
Kinase Assay
IC50
>10000±n/a nM
Citation
 Dunn, SEJayanthan, ANagireddy, JRAnnedi, SVan Drie, JHDaynard, TSHuynh, M Substituted tetrahydropyrido[3′,2′:4,5]pyrrolo[1,2-a]pyrazine-2-carboxamides as RSK inhibitors US Patent  US9771366 Publication Date 9/26/2017 
Target
Name:
Ribosomal protein S6 kinase alpha-2
Synonyms:
90 kDa ribosomal protein S6 kinase 2 KS6A2_HUMAN MAPKAPK1C RPS6KA2(Kin.Dom.1 - N-terminal) Ribosomal S6 Kinase 3 (RSK-3) Ribosomal protein S6 kinase alpha 2 (RSK2) p90-RSK 2 pp90RSK3
Type:
Serine/threonine-protein kinase
Mol. Mass.:
83259.46
Organism:
Homo sapiens (Human)
Description:
Residue:
733
  
Inhibitor
Name:
BDBM286080
Synonyms:
1-benzyl-N-(3-(morpholinomethyl)benzofuran-6-yl)-1H-pyrazole-4-carboxamide US10758530, Compound 7 | US9771366, Compound 7
Type:
Small organic molecule
Emp. Form.:
C24H24N4O3
Mol. Mass.:
416.4724
SMILES:
O=C(Nc1ccc2c(CN3CCOCC3)coc2c1)c1cnn(Cc2ccccc2)c1
: