Target
Ribosomal protein S6 kinase alpha-2
Ligand
BDBM286085
Substrate
Meas. Tech.
Kinase Assay
IC50
>1000±n/a nM
Citation
 Dunn, SEJayanthan, ANagireddy, JRAnnedi, SVan Drie, JHDaynard, TSHuynh, M Substituted tetrahydropyrido[3′,2′:4,5]pyrrolo[1,2-a]pyrazine-2-carboxamides as RSK inhibitors US Patent  US9771366 Publication Date 9/26/2017 
Target
Name:
Ribosomal protein S6 kinase alpha-2
Synonyms:
90 kDa ribosomal protein S6 kinase 2 KS6A2_HUMAN MAPKAPK1C RPS6KA2(Kin.Dom.1 - N-terminal) Ribosomal S6 Kinase 3 (RSK-3) Ribosomal protein S6 kinase alpha 2 (RSK2) p90-RSK 2 pp90RSK3
Type:
Serine/threonine-protein kinase
Mol. Mass.:
83259.46
Organism:
Homo sapiens (Human)
Description:
Residue:
733
  
Inhibitor
Name:
BDBM286085
Synonyms:
1-benzyl-N-(1-oxo-1,2,3,4-tetrahydropyrazino[1,2-a]indol-7-yl)-1H-pyrazole-4-carboxamide US10758530, Compound 12 | US9771366, Compound 12
Type:
Small organic molecule
Emp. Form.:
C22H19N5O2
Mol. Mass.:
385.4186
SMILES:
O=C(Nc1ccc2cc3C(=O)NCCn3c2c1)c1cnn(Cc2ccccc2)c1
: