Target
Ketohexokinase
Ligand
BDBM130549
Substrate
Meas. Tech.
Enzyme Assay
IC50
260±n/a nM
Citation
 Zhang, XAbad, MCGibbs, ACKuo, GSong, FSui, ZKuo, LC Indazole compounds useful as ketohexokinase inhibitors US Patent  US9771375 Publication Date 9/26/2017 
Target
Name:
Ketohexokinase
Synonyms:
Hepatic fructokinase KHK_HUMAN Ketohexokinase (KHK) | Ketohexokinase (KHK) Isoform C
Type:
Enzyme Catalytic Domain
Mol. Mass.:
32521.64
Organism:
Homo sapiens (Human)
Description:
Residue:
298
  
Inhibitor
Name:
BDBM130549
Synonyms:
US8822447, 13 | US9771375, Example 13
Type:
Small organic molecule
Emp. Form.:
C19H20N4OS
Mol. Mass.:
352.453
SMILES:
CSc1nn(-c2ccccc2)c2cc(NC(=O)C3CCCN3)ccc12
: