Target
Ketohexokinase
Ligand
BDBM130622
Substrate
Meas. Tech.
Enzyme Assay
IC50
1430±n/a nM
Citation
 Zhang, XAbad, MCGibbs, ACKuo, GSong, FSui, ZKuo, LC Indazole compounds useful as ketohexokinase inhibitors US Patent  US9771375 Publication Date 9/26/2017 
Target
Name:
Ketohexokinase
Synonyms:
Hepatic fructokinase KHK_HUMAN Ketohexokinase (KHK) | Ketohexokinase (KHK) Isoform C
Type:
Enzyme Catalytic Domain
Mol. Mass.:
32521.64
Organism:
Homo sapiens (Human)
Description:
Residue:
298
  
Inhibitor
Name:
BDBM130622
Synonyms:
US8822447, 102 | US9771375, Example 102
Type:
Small organic molecule
Emp. Form.:
C26H29N5O
Mol. Mass.:
427.5414
SMILES:
CCOc1cc(nc2n(nc(CC)c12)-c1ccccc1)-c1ccc(cc1)N1CCNCC1
: