Target
Sodium channel protein type 9 subunit alpha
Ligand
BDBM145229
Substrate
Meas. Tech.
Electrophysiological Assay (In Vitro Assay)
IC50
3.80±n/a nM
Citation
 Chowdhury, SDehnhardt, CMFocken, TGrimwood, MEHemeon, IWJia, QOrtwine, DFSafina, BSun, SSutherlin, DPZenova, AY N-substituted benzamides and methods of use thereof US Patent  US9771376 Publication Date 9/26/2017 
Target
Name:
Sodium channel protein type 9 subunit alpha
Synonyms:
NENA Peripheral sodium channel 1 SCN9A_HUMAN Voltage-gated sodium channel subunit Nav1.7 hNE-Na
Type:
Protein
Mol. Mass.:
226375.97
Organism:
Homo sapiens (Human)
Description:
Q15858
Residue:
1988
  
Inhibitor
Name:
BDBM145229
Synonyms:
US8952169, 8 | US9771376, Example 8
Type:
Small organic molecule
Emp. Form.:
C18H23ClFNO4S
Mol. Mass.:
403.896
SMILES:
CC1(C)[C@@H]2C[C@H]1[C@@H](COc1cc(F)c(cc1Cl)C(=O)NS(C)(=O)=O)CC2
: