Target
Sodium channel protein type 9 subunit alpha
Ligand
BDBM47138
Substrate
Meas. Tech.
Electrophysiological Assay (In Vitro Assay)
IC50
9.90±n/a nM
Citation
 Chowdhury, SDehnhardt, CMFocken, TGrimwood, MEHemeon, IWJia, QOrtwine, DFSafina, BSun, SSutherlin, DPZenova, AY N-substituted benzamides and methods of use thereof US Patent  US9771376 Publication Date 9/26/2017 
Target
Name:
Sodium channel protein type 9 subunit alpha
Synonyms:
NENA Peripheral sodium channel 1 SCN9A_HUMAN Voltage-gated sodium channel subunit Nav1.7 hNE-Na
Type:
Protein
Mol. Mass.:
226375.97
Organism:
Homo sapiens (Human)
Description:
Q15858
Residue:
1988
  
Inhibitor
Name:
BDBM47138
Synonyms:
US8952169, 268 US9771376, Example 30
Type:
Emp. Form.:
C15H19ClFNO4S
Mol. Mass.:
363.832
SMILES:
CS(=O)(=O)NC(=O)c1cc(Cl)c(OCC2CCCCC2)cc1F
: