Target
Sodium channel protein type 9 subunit alpha
Ligand
BDBM145291
Substrate
Meas. Tech.
Electrophysiological Assay (In Vitro Assay)
IC50
36.8±n/a nM
Citation
 Chowdhury, SDehnhardt, CMFocken, TGrimwood, MEHemeon, IWJia, QOrtwine, DFSafina, BSun, SSutherlin, DPZenova, AY N-substituted benzamides and methods of use thereof US Patent  US9771376 Publication Date 9/26/2017 
Target
Name:
Sodium channel protein type 9 subunit alpha
Synonyms:
NENA Peripheral sodium channel 1 SCN9A_HUMAN Voltage-gated sodium channel subunit Nav1.7 hNE-Na
Type:
Protein
Mol. Mass.:
226375.97
Organism:
Homo sapiens (Human)
Description:
Q15858
Residue:
1988
  
Inhibitor
Name:
BDBM145291
Synonyms:
US8952169, 70 | US9771376, Example 70
Type:
Small organic molecule
Emp. Form.:
C21H26ClFN2O4S
Mol. Mass.:
456.959
SMILES:
Fc1cc(OCC23CC4CC(CC(C4)C2)C3)c(Cl)cc1C(=O)NS(=O)(=O)N1CCC1
: