Target
Sodium channel protein type 9 subunit alpha
Ligand
BDBM145360
Substrate
Meas. Tech.
Electrophysiological Assay (In Vitro Assay)
IC50
85.4±n/a nM
Citation
 Chowdhury, SDehnhardt, CMFocken, TGrimwood, MEHemeon, IWJia, QOrtwine, DFSafina, BSun, SSutherlin, DPZenova, AY N-substituted benzamides and methods of use thereof US Patent  US9771376 Publication Date 9/26/2017 
Target
Name:
Sodium channel protein type 9 subunit alpha
Synonyms:
NENA Peripheral sodium channel 1 SCN9A_HUMAN Voltage-gated sodium channel subunit Nav1.7 hNE-Na
Type:
Protein
Mol. Mass.:
226375.97
Organism:
Homo sapiens (Human)
Description:
Q15858
Residue:
1988
  
Inhibitor
Name:
BDBM145360
Synonyms:
BDBM342455 | US8952169, 139
Type:
Small organic molecule
Emp. Form.:
C20H28ClFN2O4S
Mol. Mass.:
446.964
SMILES:
CN(C)S(=O)(=O)NC(=O)c1cc(Cl)c(OC2CCC3(CCCCC3)CC2)cc1F
: