Target
Sodium channel protein type 9 subunit alpha
Ligand
BDBM145369
Substrate
Meas. Tech.
Electrophysiological Assay (In Vitro Assay)
IC50
1.40±n/a nM
Citation
 Chowdhury, SDehnhardt, CMFocken, TGrimwood, MEHemeon, IWJia, QOrtwine, DFSafina, BSun, SSutherlin, DPZenova, AY N-substituted benzamides and methods of use thereof US Patent  US9771376 Publication Date 9/26/2017 
Target
Name:
Sodium channel protein type 9 subunit alpha
Synonyms:
NENA Peripheral sodium channel 1 SCN9A_HUMAN Voltage-gated sodium channel subunit Nav1.7 hNE-Na
Type:
Protein
Mol. Mass.:
226375.97
Organism:
Homo sapiens (Human)
Description:
Q15858
Residue:
1988
  
Inhibitor
Name:
BDBM145369
Synonyms:
US8952169, 148 | US9771376, Example 148
Type:
Small organic molecule
Emp. Form.:
C24H30FNO4S
Mol. Mass.:
447.563
SMILES:
Fc1cc(OCC23CC4CC(CC(C4)C2)C3)c(cc1C(=O)NS(=O)(=O)C1CC1)C1CC1
: