Target
Tyrosine-protein kinase SYK
Ligand
BDBM340003
Substrate
Meas. Tech.
Homogeneous Time-Resolved Fluorescence (HTRF) Assay
IC50
1.6±n/a nM
Citation
 Altman, MDCash, BEllis, JMMaddess, MLNorthrup, ABOtte, RDSun, B 2-pyrazine carboxamides as spleen tyrosine kinase inhibitors US Patent  US9775839 Publication Date 10/3/2017 
Target
Name:
Tyrosine-protein kinase SYK
Synonyms:
KSYK_HUMAN Spleen Tyrosine Kinase Tyrosine-protein kinase SYK (Syk)
Type:
Enzyme
Mol. Mass.:
72079.99
Organism:
Homo sapiens (Human)
Description:
P43405
Residue:
635
  
Inhibitor
Name:
BDBM340003
Synonyms:
5-{[(3R,4R)-3- aminotetrahydro-2H-pyran-4- yl]amino}-3-(1H-pyrrolo[3,2- b]pyridin-2-yl)pyrazine-2- carboxamide | US9775839, 10.8
Type:
Small organic molecule
Emp. Form.:
C17H19N7O2
Mol. Mass.:
353.3785
SMILES:
N[C@H]1COCC[C@H]1Nc1cnc(C(N)=O)c(n1)-c1cc2ncccc2[nH]1
: