Target
Lysine-specific histone demethylase 1A
Ligand
BDBM283241
Substrate
Meas. Tech.
In Vitro Enzyme Inhibition Assay
IC50
<100±n/a nM
Citation
 Chen, YKKanouni, TKaldor, SWStafford, JAVeal, JM Inhibitors of lysine specific demethylase-1 US Patent  US9776974 Publication Date 10/3/2017 
Target
Name:
Lysine-specific histone demethylase 1A
Synonyms:
AOF2 Flavin-containing amine oxidase domain-containing protein 2 KDM1A KIAA0601 Lysine-specific demethylase 1 (LSD1) Lysine-specific histone demethylase 1 (LSD1)
Type:
Enzyme
Mol. Mass.:
92901.01
Organism:
Homo sapiens (Human)
Description:
O60341
Residue:
852
  
Inhibitor
Name:
BDBM283241
Synonyms:
4-[2-((3S)-3-amino-piperidin-1- yl)-5-(3-fluoro-4-methoxy-phenyl)- 1-methyl-6-oxo-1,6-dihydro- pyrimidin-4-yl]-2-fluoro- benzonitrile US10207999, Example 28 US10548896, Example 28 US10960005, Example 28 US9573930, Example 28 US9776974, Example 28
Type:
Small organic molecule
Emp. Form.:
C24H23F2N5O2
Mol. Mass.:
451.4685
SMILES:
COc1ccc(cc1F)-c1c(nc(N2CCC[C@H](N)C2)n(C)c1=O)-c1ccc(C#N)c(F)c1
: