Target
Lysine-specific histone demethylase 1A
Ligand
BDBM283249
Substrate
Meas. Tech.
In Vitro Enzyme Inhibition Assay
IC50
<100±n/a nM
Citation
 Chen, YKKanouni, TKaldor, SWStafford, JAVeal, JM Inhibitors of lysine specific demethylase-1 US Patent  US9776974 Publication Date 10/3/2017 
Target
Name:
Lysine-specific histone demethylase 1A
Synonyms:
AOF2 Flavin-containing amine oxidase domain-containing protein 2 KDM1A KIAA0601 Lysine-specific demethylase 1 (LSD1) Lysine-specific histone demethylase 1 (LSD1)
Type:
Enzyme
Mol. Mass.:
92901.01
Organism:
Homo sapiens (Human)
Description:
O60341
Residue:
852
  
Inhibitor
Name:
BDBM283249
Synonyms:
4-{2-(4-amino-piperidin-1-yl)-1- methyl-6-oxo-5-[1-(2,2,2-trifluoro- ethyl)-1H-pyrazol-4-yl]-1,6- dihydro-pyrimidin-4-yl}-2-fluoro- benzonitrile US10207999, Example 34 US10548896, Example 34 US10960005, Example 34 US9573930, Example 34 US9776974, Example 34
Type:
Small organic molecule
Emp. Form.:
C22H21F4N7O
Mol. Mass.:
475.4421
SMILES:
Cn1c(nc(-c2ccc(C#N)c(F)c2)c(-c2cnn(CC(F)(F)F)c2)c1=O)N1CCC(N)CC1
: