Target
Lysine-specific histone demethylase 1A
Ligand
BDBM283264
Substrate
Meas. Tech.
In Vitro Enzyme Inhibition Assay
IC50
<100±n/a nM
Citation
 Chen, YKKanouni, TKaldor, SWStafford, JAVeal, JM Inhibitors of lysine specific demethylase-1 US Patent  US9776974 Publication Date 10/3/2017 
Target
Name:
Lysine-specific histone demethylase 1A
Synonyms:
AOF2 Flavin-containing amine oxidase domain-containing protein 2 KDM1A KIAA0601 Lysine-specific demethylase 1 (LSD1) Lysine-specific histone demethylase 1 (LSD1)
Type:
Enzyme
Mol. Mass.:
92901.01
Organism:
Homo sapiens (Human)
Description:
O60341
Residue:
852
  
Inhibitor
Name:
BDBM283264
Synonyms:
2-fluoro-4-[5-(3-fluoro- 4-methoxy-phenyl)-1-methyl-6- oxo-2-piperazin-1-yl-1,6-dihydro- pyrimidin-4-yl]-benzonitrile US10207999, Example 47 US10548896, Example 47 US10960005, Example 47 US9573930, Example 47 US9776974, Example 47
Type:
Small organic molecule
Emp. Form.:
C23H21F2N5O2
Mol. Mass.:
437.4419
SMILES:
COc1ccc(cc1F)-c1c(nc(N2CCNCC2)n(C)c1=O)-c1ccc(C#N)c(F)c1
: