Target
Bromodomain-containing protein 4
Ligand
BDBM342586
Substrate
Ki
2920±n/a nM
Citation
 Pratt, JKLiu, DPark, CHSheppard, GSHasvold, LAWang, L Isoindolone derivatives US Patent  US9776990 Publication Date 10/3/2017 
Target
Name:
Bromodomain-containing protein 4
Synonyms:
BRD4 Bromodomain-containing protein 4 (BRD4) Protein HUNK1
Type:
Protein
Mol. Mass.:
152264.84
Organism:
Homo sapiens (Human)
Description:
O60885
Residue:
1362
  
Inhibitor
Name:
BDBM342586
Synonyms:
3-methyl-1-[2-(tetrahydrofuran-3-ylmethoxy)phenyl]-2,5,6,7-tetrahydro-4H-isoindol-4-one | US9776990, Example 29
Type:
Small organic molecule
Emp. Form.:
C20H23NO3
Mol. Mass.:
325.4015
SMILES:
Cc1[nH]c(c2CCCC(=O)c12)-c1ccccc1OCC1CCOC1
: