Target
Bromodomain-containing protein 4
Ligand
BDBM342613
Substrate
Meas. Tech.
TR-FRET Assay
Ki
68.0±n/a nM
Citation
 Pratt, JKLiu, DPark, CHSheppard, GSHasvold, LAWang, L Isoindolone derivatives US Patent  US9776990 Publication Date 10/3/2017 
Target
Name:
Bromodomain-containing protein 4
Synonyms:
BRD4 Bromodomain-containing protein 4 (BRD4) Protein HUNK1
Type:
Protein
Mol. Mass.:
152264.84
Organism:
Homo sapiens (Human)
Description:
O60885
Residue:
1362
  
Inhibitor
Name:
BDBM342613
Synonyms:
3-(3-methyl-4-oxo-4,5,6,7-tetrahydro-2H-isoindol-1-yl)-4-phenoxy-N-(tetrahydrofuran-2-ylmethyl)benzamide | US9776990, Example 56
Type:
Small organic molecule
Emp. Form.:
C27H28N2O4
Mol. Mass.:
444.5222
SMILES:
Cc1[nH]c(c2CCCC(=O)c12)-c1cc(ccc1Oc1ccccc1)C(=O)NCC1CCCO1
: