Target
Urokinase-type plasminogen activator
Ligand
BDBM14150
Substrate
BDBM14484
Meas. Tech.
Enzyme Assay and Determination of the Inhibition Constants
Ki
16±n/a nM
Citation
 Katz, BALuong, CHo, JDSomoza, JRGjerstad, ETang, JWilliams, SRVerner, EMackman, RLYoung, WBSprengeler, PAChan, HMortara, KJanc, JWMcGrath, ME Dissecting and designing inhibitor selectivity determinants at the S1 site using an artificial Ala190 protease (Ala190 uPA). J Mol Biol 344:527-47 (2004)  
Target
Name:
Urokinase-type plasminogen activator
Synonyms:
3.4.21.73 U-plasminogen activator Urokinase Urokinase-type plasminogen activator chain B Urokinase-type plasminogen activator short chain A uPA
Type:
Enzyme
Mol. Mass.:
48528.62
Organism:
Homo sapiens (Human)
Description:
P00749
Residue:
431
  
Inhibitor
Name:
BDBM14150
Synonyms:
APC-11417 CRA-11417 | {amino[6-fluoro-2-(2-hydroxy-3-phenylphenyl)-1H-indol-5-yl]methylidene}azanium
Type:
Small organic molecule
Emp. Form.:
C21H17FN3O
Mol. Mass.:
346.377
SMILES:
NC(=[NH2+])c1cc2cc([nH]c2cc1F)-c1cccc(-c2ccccc2)c1O
:
Substrate
Name:
BDBM14484
Synonyms:
4-{[({4-carbamimidamido-1-[(4-methyl-2-oxo-2H-chromen-7-yl)carbamoyl]butyl}carbamoyl)methyl]carbamoyl}butanoic acid hydrochloride uPA Substrate
Type:
Emp. Form.:
Mol. Mass.:
SMILES:
: