Target
Urokinase-type plasminogen activator
Ligand
BDBM14482
Substrate
BDBM14484
Meas. Tech.
Enzyme Assay and Determination of the Inhibition Constants
Ki
4500±n/a nM
Citation
 Katz, BALuong, CHo, JDSomoza, JRGjerstad, ETang, JWilliams, SRVerner, EMackman, RLYoung, WBSprengeler, PAChan, HMortara, KJanc, JWMcGrath, ME Dissecting and designing inhibitor selectivity determinants at the S1 site using an artificial Ala190 protease (Ala190 uPA). J Mol Biol 344:527-47 (2004)  
Target
Name:
Urokinase-type plasminogen activator
Synonyms:
3.4.21.73 U-plasminogen activator Urokinase Urokinase-type plasminogen activator chain B Urokinase-type plasminogen activator short chain A uPA
Type:
Enzyme
Mol. Mass.:
48528.62
Organism:
Homo sapiens (Human)
Description:
P00749
Residue:
431
  
Inhibitor
Name:
BDBM14482
Synonyms:
2-amino-5-[(3-hydroxynaphthalene-2-)amido]-1H-1,3-benzodiazol-3-ium | CA-24
Type:
Small organic molecule
Emp. Form.:
C18H15N4O2
Mol. Mass.:
319.3368
SMILES:
Nc1[nH]c2ccc(NC(=O)c3cc4ccccc4cc3O)cc2[nH+]1
:
Substrate
Name:
BDBM14484
Synonyms:
4-{[({4-carbamimidamido-1-[(4-methyl-2-oxo-2H-chromen-7-yl)carbamoyl]butyl}carbamoyl)methyl]carbamoyl}butanoic acid hydrochloride uPA Substrate
Type:
Emp. Form.:
Mol. Mass.:
SMILES:
: