Target
Tyrosine-protein kinase JAK2
Ligand
BDBM344023
Substrate
Meas. Tech.
In Vitro JAK Kinase Assay
IC50
<2000±n/a nM
Citation
 Li, YZhu, WMei, S Tricyclic fused thiophene derivatives as JAK inhibitors US Patent  US9777017 Publication Date 10/3/2017 
Target
Name:
Tyrosine-protein kinase JAK2
Synonyms:
JAK-2 JAK2_HUMAN Janus kinase 2 (JAK2) | Janus kinase 2 (a protein tyrosine kinase)
Type:
Protein
Mol. Mass.:
130684.68
Organism:
Homo sapiens (Human)
Description:
O60674
Residue:
1132
  
Inhibitor
Name:
BDBM344023
Synonyms:
US10370387, Example 7 US9777017, Example 7 | US9908895, Example 7
Type:
Small organic molecule
Emp. Form.:
C17H18N4OS
Mol. Mass.:
326.416
SMILES:
C[C@@H](O)c1nc2cnc3ccsc3c2n1[C@@H]1CC[C@@H](CC1)C#N
: