Target
High affinity nerve growth factor receptor
Ligand
BDBM344339
Substrate
Meas. Tech.
TrkA ELISA Assay
IC50
0.600±n/a nM
Citation
 Allen, SAndrews, SWCondroski, KRHaas, JHuang, LJiang, YKercher, TSeo, J Substituted pyrazolo[1,5-a]pyrimidine compounds as Trk kinase inhibitors US Patent  US9782415 Publication Date 10/10/2017 
Target
Name:
High affinity nerve growth factor receptor
Synonyms:
2.7.10.1 NTRK1 NTRK1_HUMAN Neurotrophic tyrosine kinase receptor type 1 Synonyms=MTC TRK1-transforming tyrosine kinase protein TRKA GN Trk-A Tropomyosin-related kinase A Tyrosine kinase receptor Tyrosine kinase receptor A Tyrosine kinase receptor A (Trk-A) gp140trk | p140-TrkA
Type:
Mol. Mass.:
87498.18
Organism:
Homo sapiens (Human)
Description:
P04629
Residue:
796
  
Inhibitor
Name:
BDBM344339
Synonyms:
US10251889, Example 48 US9782415, Example 48 | US9796724, Example 48
Type:
Small organic molecule
Emp. Form.:
C21H22FN5O2
Mol. Mass.:
395.4301
SMILES:
OCc1ccc(F)cc1[C@H]1CCCN1c1ccn2ncc(C(=O)NC3CC3)c2n1
: