Target
Epidermal growth factor receptor
Ligand
BDBM270540
Substrate
Meas. Tech.
Kinase Assay (EGFR)
IC50
273±n/a nM
Citation
 Hu, SLiu, XBai, JLong, W Protein tyrosine kinase modulators and methods of use US Patent  US9783524 Publication Date 10/10/2017 
Target
Name:
Epidermal growth factor receptor
Synonyms:
EGF Receptor Substrate EGFR_HUMAN ERBB1 Epidermal Growth Factor Receptor erbB-1 Epidermal growth factor receptor (EGFR) HER1 Proto-oncogene c-ErbB-1 Tyrosine-Protein Kinase ErbB-1
Type:
Receptor Kinase Domain
Mol. Mass.:
134279.59
Organism:
Homo sapiens (Human)
Description:
P00533
Residue:
1210
  
Inhibitor
Name:
BDBM270540
Synonyms:
N-(3-(5-chloro-4-(2-(2- (dimethylamino)-2-oxoacetyl) phenylamino)pyrimidin-2- ylamino)-4-methoxyphenyl) acrylamide US9783524, Example 67
Type:
Small organic molecule
Emp. Form.:
C24H23ClN6O4
Mol. Mass.:
494.93
SMILES:
COc1ccc(NC(=O)C=C)cc1Nc1ncc(Cl)c(Nc2ccccc2C(=O)C(=O)N(C)C)n1
: