Target
Epidermal growth factor receptor [T790M,L858R]
Ligand
BDBM344704
Substrate
Meas. Tech.
Kinase Assay (EGFR)(T790M)(L858R)
IC50
15.5±n/a nM
Citation
 Hu, SLiu, XBai, JLong, W Protein tyrosine kinase modulators and methods of use US Patent  US9783524 Publication Date 10/10/2017 
Target
Name:
Epidermal growth factor receptor [T790M,L858R]
Synonyms:
EGFR EGFR_HUMAN ERBB1 Epidermal growth factor receptor (EGFR)(T790M/L858R) Epidermal growth factor receptor (T790M, L858R) Epidermal growth factor receptor(L858R, T790M) | HER1
Type:
Mol. Mass.:
134353.72
Organism:
Homo sapiens (Human)
Description:
P00533[T790M,L858R]
Residue:
1210
  
Inhibitor
Name:
BDBM344704
Synonyms:
Compound 74 | US9783524, Example 74
Type:
Small organic molecule
Emp. Form.:
C29H33ClN8O4
Mol. Mass.:
593.077
SMILES:
COc1cc(N2CCN(C)CC2)c(NC(=O)C=C)cc1Nc1ncc(Cl)c(Nc2ccccc2C(=O)C(=O)N(C)C)n1
: