Target
ALK tyrosine kinase receptor
Ligand
BDBM270543
Substrate
Meas. Tech.
Kinase Assay (ALK)
IC50
8.62±n/a nM
Citation
 Hu, SLiu, XBai, JLong, W Protein tyrosine kinase modulators and methods of use US Patent  US9783524 Publication Date 10/10/2017 
Target
Name:
ALK tyrosine kinase receptor
Synonyms:
ALK ALK_HUMAN CD_antigen: CD246
Type:
Protein
Mol. Mass.:
176453.10
Organism:
Homo sapiens (Human)
Description:
Q9UM73
Residue:
1620
  
Inhibitor
Name:
BDBM270543
Synonyms:
US10059688, Example 115 | US9783524, Example 115
Type:
Small organic molecule
Emp. Form.:
C27H30ClN7O4
Mol. Mass.:
552.025
SMILES:
CN(C)CCOc1ccc(Nc2ncc(Cl)c(Nc3ccccc3C(=O)C(=O)N(C)C)n2)cc1NC(=O)C=C
: