Target
Epidermal growth factor receptor [T790M,L858R]
Ligand
BDBM270543
Substrate
Meas. Tech.
Kinase Assay (EGFR)(T790M)(L858R)
IC50
11.7±n/a nM
Citation
 Hu, SLiu, XBai, JLong, W Protein tyrosine kinase modulators and methods of use US Patent  US9783524 Publication Date 10/10/2017 
Target
Name:
Epidermal growth factor receptor [T790M,L858R]
Synonyms:
EGFR EGFR_HUMAN ERBB1 Epidermal growth factor receptor (EGFR)(T790M/L858R) Epidermal growth factor receptor (T790M, L858R) Epidermal growth factor receptor(L858R, T790M) | HER1
Type:
Mol. Mass.:
134353.72
Organism:
Homo sapiens (Human)
Description:
P00533[T790M,L858R]
Residue:
1210
  
Inhibitor
Name:
BDBM270543
Synonyms:
US10059688, Example 115 | US9783524, Example 115
Type:
Small organic molecule
Emp. Form.:
C27H30ClN7O4
Mol. Mass.:
552.025
SMILES:
CN(C)CCOc1ccc(Nc2ncc(Cl)c(Nc3ccccc3C(=O)C(=O)N(C)C)n2)cc1NC(=O)C=C
: