Target
Proto-oncogene tyrosine-protein kinase Src
Ligand
BDBM345120
Substrate
Meas. Tech.
Enzyme Inhibition
IC50
77.0±n/a nM
Citation
 Fyfe, MCMeghani, PThom, SM Kinase inhibitors US Patent  US9783556 Publication Date 10/10/2017 
Target
Name:
Proto-oncogene tyrosine-protein kinase Src
Synonyms:
Calmodulin/Proto-oncogene tyrosine-protein kinase Src Proto-oncogene c-Src SRC SRC_HUMAN V-src sarcoma (Schmidt-Ruppin A-2) viral oncogene homolog (avian) p60-Src | pp60c-src
Type:
Protein
Mol. Mass.:
59838.60
Organism:
Homo sapiens (Human)
Description:
P12931
Residue:
536
  
Inhibitor
Name:
BDBM345120
Synonyms:
1-(4-((2-(Phenylamino)pyrimidin-4-yl)oxy)naphthalen-1-yl)-3-(1-(p-tolyl)-3-(trimethylsilyl)-1H-pyrazol-5-yl)urea | US9783556, Example 1
Type:
Small organic molecule
Emp. Form.:
C34H33N7O2Si
Mol. Mass.:
599.757
SMILES:
Cc1ccc(cc1)-n1nc(cc1NC(=O)Nc1ccc(Oc2ccnc(Nc3ccccc3)n2)c2ccccc12)[Si](C)(C)C
: