Target
Proto-oncogene tyrosine-protein kinase Src
Ligand
BDBM345130
Substrate
Meas. Tech.
Enzyme Inhibition
IC50
93.0±n/a nM
Citation
 Fyfe, MCMeghani, PThom, SM Kinase inhibitors US Patent  US9783556 Publication Date 10/10/2017 
Target
Name:
Proto-oncogene tyrosine-protein kinase Src
Synonyms:
Calmodulin/Proto-oncogene tyrosine-protein kinase Src Proto-oncogene c-Src SRC SRC_HUMAN V-src sarcoma (Schmidt-Ruppin A-2) viral oncogene homolog (avian) p60-Src | pp60c-src
Type:
Protein
Mol. Mass.:
59838.60
Organism:
Homo sapiens (Human)
Description:
P12931
Residue:
536
  
Inhibitor
Name:
BDBM345130
Synonyms:
1-(1-(6-Methoxypyridin-3-yl)-3-(trimethylsilyl)-1H-pyrazol-5-yl)-3-(4-((2-(phenylamino)pyrimidin-4-yl)oxy)naphthalen-1-yl)urea | US9783556, Example 2
Type:
Small organic molecule
Emp. Form.:
C33H32N8O3Si
Mol. Mass.:
616.7445
SMILES:
COc1ccc(cn1)-n1nc(cc1NC(=O)Nc1ccc(Oc2ccnc(Nc3ccccc3)n2)c2ccccc12)[Si](C)(C)C
: