Target
Glycogen synthase kinase-3 alpha
Ligand
BDBM345130
Substrate
Meas. Tech.
Enzyme Inhibition
IC50
120±n/a nM
Citation
 Fyfe, MCMeghani, PThom, SM Kinase inhibitors US Patent  US9783556 Publication Date 10/10/2017 
Target
Name:
Glycogen synthase kinase-3 alpha
Synonyms:
GSK-3 alpha GSK3A_HUMAN Glycogen synthase kinase-3 Glycogen synthase kinase-3 alpha (GSK3 Alpha) Glycogen synthase kinase-3 alpha (GSK3alpha)
Type:
Enzyme
Mol. Mass.:
50991.79
Organism:
Homo sapiens (Human)
Description:
P49840
Residue:
483
  
Inhibitor
Name:
BDBM345130
Synonyms:
1-(1-(6-Methoxypyridin-3-yl)-3-(trimethylsilyl)-1H-pyrazol-5-yl)-3-(4-((2-(phenylamino)pyrimidin-4-yl)oxy)naphthalen-1-yl)urea | US9783556, Example 2
Type:
Small organic molecule
Emp. Form.:
C33H32N8O3Si
Mol. Mass.:
616.7445
SMILES:
COc1ccc(cn1)-n1nc(cc1NC(=O)Nc1ccc(Oc2ccnc(Nc3ccccc3)n2)c2ccccc12)[Si](C)(C)C
: