Target
5-hydroxytryptamine receptor 2A
Ligand
BDBM345131
Substrate
Meas. Tech.
Enzyme Inhibition
IC50
347±n/a nM
Citation
 Fyfe, MCMeghani, PThom, SM Kinase inhibitors US Patent  US9783556 Publication Date 10/10/2017 
Target
Name:
5-hydroxytryptamine receptor 2A
Synonyms:
5-HT-2 5-HT2A 5-hydroxytryptamine receptor 2A (5HT-2A) 5HT2A_HUMAN HTR2A | Serotonin receptor 2A
Type:
undefined
Mol. Mass.:
52607.65
Organism:
Homo sapiens (Human)
Description:
P28223
Residue:
471
  
Inhibitor
Name:
BDBM345131
Synonyms:
1-(1-(4-(2-Morpholinoethoxy)phenyl)-3-(trimethylsilyl)-1H-pyrazol-5-yl)-3-(4-((2-(phenylamino)pyrimidin-4-yl)oxy)naphthalen-1-yl)urea | US9783556, Example 3
Type:
Small organic molecule
Emp. Form.:
C39H42N8O4Si
Mol. Mass.:
714.8875
SMILES:
C[Si](C)(C)c1cc(NC(=O)Nc2ccc(Oc3ccnc(Nc4ccccc4)n3)c3ccccc23)n(n1)-c1ccc(OCCN2CCOCC2)cc1
: