Target
Proto-oncogene tyrosine-protein kinase Src
Ligand
BDBM345131
Substrate
Meas. Tech.
Enzyme Inhibition
IC50
227±n/a nM
Citation
 Fyfe, MCMeghani, PThom, SM Kinase inhibitors US Patent  US9783556 Publication Date 10/10/2017 
Target
Name:
Proto-oncogene tyrosine-protein kinase Src
Synonyms:
Calmodulin/Proto-oncogene tyrosine-protein kinase Src Proto-oncogene c-Src SRC SRC_HUMAN V-src sarcoma (Schmidt-Ruppin A-2) viral oncogene homolog (avian) p60-Src | pp60c-src
Type:
Protein
Mol. Mass.:
59838.60
Organism:
Homo sapiens (Human)
Description:
P12931
Residue:
536
  
Inhibitor
Name:
BDBM345131
Synonyms:
1-(1-(4-(2-Morpholinoethoxy)phenyl)-3-(trimethylsilyl)-1H-pyrazol-5-yl)-3-(4-((2-(phenylamino)pyrimidin-4-yl)oxy)naphthalen-1-yl)urea | US9783556, Example 3
Type:
Small organic molecule
Emp. Form.:
C39H42N8O4Si
Mol. Mass.:
714.8875
SMILES:
C[Si](C)(C)c1cc(NC(=O)Nc2ccc(Oc3ccnc(Nc4ccccc4)n3)c3ccccc23)n(n1)-c1ccc(OCCN2CCOCC2)cc1
: