Target
Glycogen synthase kinase-3 alpha
Ligand
BDBM345131
Substrate
Meas. Tech.
Enzyme Inhibition
IC50
498±n/a nM
Citation
 Fyfe, MCMeghani, PThom, SM Kinase inhibitors US Patent  US9783556 Publication Date 10/10/2017 
Target
Name:
Glycogen synthase kinase-3 alpha
Synonyms:
GSK-3 alpha GSK3A_HUMAN Glycogen synthase kinase-3 Glycogen synthase kinase-3 alpha (GSK3 Alpha) Glycogen synthase kinase-3 alpha (GSK3alpha)
Type:
Enzyme
Mol. Mass.:
50991.79
Organism:
Homo sapiens (Human)
Description:
P49840
Residue:
483
  
Inhibitor
Name:
BDBM345131
Synonyms:
1-(1-(4-(2-Morpholinoethoxy)phenyl)-3-(trimethylsilyl)-1H-pyrazol-5-yl)-3-(4-((2-(phenylamino)pyrimidin-4-yl)oxy)naphthalen-1-yl)urea | US9783556, Example 3
Type:
Small organic molecule
Emp. Form.:
C39H42N8O4Si
Mol. Mass.:
714.8875
SMILES:
C[Si](C)(C)c1cc(NC(=O)Nc2ccc(Oc3ccnc(Nc4ccccc4)n3)c3ccccc23)n(n1)-c1ccc(OCCN2CCOCC2)cc1
: