Target
Tyrosine-protein kinase SYK
Ligand
BDBM345134
Substrate
Meas. Tech.
Enzyme Inhibition
IC50
7.00±n/a nM
Citation
 Fyfe, MCMeghani, PThom, SM Kinase inhibitors US Patent  US9783556 Publication Date 10/10/2017 
Target
Name:
Tyrosine-protein kinase SYK
Synonyms:
KSYK_HUMAN Spleen Tyrosine Kinase Tyrosine-protein kinase SYK (Syk)
Type:
Enzyme
Mol. Mass.:
72079.99
Organism:
Homo sapiens (Human)
Description:
P43405
Residue:
635
  
Inhibitor
Name:
BDBM345134
Synonyms:
1-(4-((2-((3-(2-Morpholinoethoxy)phenyl)amino)pyrimidin-4-yl)oxy)naphthalen-1-yl)-3-(1-(p-tolyl)-3-(trimethylsilyl)-1H-pyrazol-5-yl)urea | US9783556, Example 6
Type:
Small organic molecule
Emp. Form.:
C40H44N8O4Si
Mol. Mass.:
728.9141
SMILES:
Cc1ccc(cc1)-n1nc(cc1NC(=O)Nc1ccc(Oc2ccnc(Nc3cccc(OCCN4CCOCC4)c3)n2)c2ccccc12)[Si](C)(C)C
: