Target
5-hydroxytryptamine receptor 2A
Ligand
BDBM345135
Substrate
Meas. Tech.
Enzyme Inhibition
IC50
380±n/a nM
Citation
 Fyfe, MCMeghani, PThom, SM Kinase inhibitors US Patent  US9783556 Publication Date 10/10/2017 
Target
Name:
5-hydroxytryptamine receptor 2A
Synonyms:
5-HT-2 5-HT2A 5-hydroxytryptamine receptor 2A (5HT-2A) 5HT2A_HUMAN HTR2A | Serotonin receptor 2A
Type:
undefined
Mol. Mass.:
52607.65
Organism:
Homo sapiens (Human)
Description:
P28223
Residue:
471
  
Inhibitor
Name:
BDBM345135
Synonyms:
1-[4-[2-(1H-Indazol-5-ylamino)pyrimidin-4-yl]oxy-1-naphthyl]-3-[2-(p-tolyl)-5-trimethylsilyl-pyrazol-3-yl]urea | US9783556, Example 7
Type:
Small organic molecule
Emp. Form.:
C35H33N9O2Si
Mol. Mass.:
639.7811
SMILES:
Cc1ccc(cc1)-n1nc(cc1NC(=O)Nc1ccc(Oc2ccnc(Nc3ccc4[nH]ncc4c3)n2)c2ccccc12)[Si](C)(C)C
: