Target
Tyrosine-protein kinase SYK
Ligand
BDBM345135
Substrate
Meas. Tech.
Enzyme Inhibition
IC50
673±n/a nM
Citation
 Fyfe, MCMeghani, PThom, SM Kinase inhibitors US Patent  US9783556 Publication Date 10/10/2017 
Target
Name:
Tyrosine-protein kinase SYK
Synonyms:
KSYK_HUMAN Spleen Tyrosine Kinase Tyrosine-protein kinase SYK (Syk)
Type:
Enzyme
Mol. Mass.:
72079.99
Organism:
Homo sapiens (Human)
Description:
P43405
Residue:
635
  
Inhibitor
Name:
BDBM345135
Synonyms:
1-[4-[2-(1H-Indazol-5-ylamino)pyrimidin-4-yl]oxy-1-naphthyl]-3-[2-(p-tolyl)-5-trimethylsilyl-pyrazol-3-yl]urea | US9783556, Example 7
Type:
Small organic molecule
Emp. Form.:
C35H33N9O2Si
Mol. Mass.:
639.7811
SMILES:
Cc1ccc(cc1)-n1nc(cc1NC(=O)Nc1ccc(Oc2ccnc(Nc3ccc4[nH]ncc4c3)n2)c2ccccc12)[Si](C)(C)C
: