Target
Tyrosine-protein kinase SYK
Ligand
BDBM345136
Substrate
Meas. Tech.
Enzyme Inhibition
IC50
269±n/a nM
Citation
 Fyfe, MCMeghani, PThom, SM Kinase inhibitors US Patent  US9783556 Publication Date 10/10/2017 
Target
Name:
Tyrosine-protein kinase SYK
Synonyms:
KSYK_HUMAN Spleen Tyrosine Kinase Tyrosine-protein kinase SYK (Syk)
Type:
Enzyme
Mol. Mass.:
72079.99
Organism:
Homo sapiens (Human)
Description:
P43405
Residue:
635
  
Inhibitor
Name:
BDBM345136
Synonyms:
1-(4-((2-((3-Aminobenzo[d]isoxazol-5-yl)amino)pyrimidin-4-yl)oxy)naphthalen-1-yl)-3-(1-(p-tolyl)-3-(trimethylsilyl)-1H-pyrazol-5-yl)urea | US9783556, Example 8
Type:
Small organic molecule
Emp. Form.:
C35H33N9O3Si
Mol. Mass.:
655.7805
SMILES:
Cc1ccc(cc1)-n1nc(cc1NC(=O)Nc1ccc(Oc2ccnc(Nc3ccc4onc(N)c4c3)n2)c2ccccc12)[Si](C)(C)C
: