Target
5-hydroxytryptamine receptor 2A
Ligand
BDBM345138
Substrate
Meas. Tech.
Enzyme Inhibition
IC50
541±n/a nM
Citation
 Fyfe, MCMeghani, PThom, SM Kinase inhibitors US Patent  US9783556 Publication Date 10/10/2017 
Target
Name:
5-hydroxytryptamine receptor 2A
Synonyms:
5-HT-2 5-HT2A 5-hydroxytryptamine receptor 2A (5HT-2A) 5HT2A_HUMAN HTR2A | Serotonin receptor 2A
Type:
undefined
Mol. Mass.:
52607.65
Organism:
Homo sapiens (Human)
Description:
P28223
Residue:
471
  
Inhibitor
Name:
BDBM345138
Synonyms:
1-(4-((2-((2-Oxoindolin-6-yl)amino)pyrimidin-4-yl)oxy)naphthalen-1-yl)-3-(1-(p-tolyl)-3-(trimethylsilyl)-1H-pyrazol-5-yl)urea | US9783556, Example 10
Type:
Small organic molecule
Emp. Form.:
C36H34N8O3Si
Mol. Mass.:
654.7925
SMILES:
Cc1ccc(cc1)-n1nc(cc1NC(=O)Nc1ccc(Oc2ccnc(Nc3ccc4CC(=O)Nc4c3)n2)c2ccccc12)[Si](C)(C)C
: