Target
5-hydroxytryptamine receptor 2A
Ligand
BDBM345140
Substrate
Meas. Tech.
Enzyme Inhibition
IC50
142±n/a nM
Citation
 Fyfe, MCMeghani, PThom, SM Kinase inhibitors US Patent  US9783556 Publication Date 10/10/2017 
Target
Name:
5-hydroxytryptamine receptor 2A
Synonyms:
5-HT-2 5-HT2A 5-hydroxytryptamine receptor 2A (5HT-2A) 5HT2A_HUMAN HTR2A | Serotonin receptor 2A
Type:
undefined
Mol. Mass.:
52607.65
Organism:
Homo sapiens (Human)
Description:
P28223
Residue:
471
  
Inhibitor
Name:
BDBM345140
Synonyms:
3-Methoxy-N-(2-morpholinoethyl)-5-((4-((4-(3-(1-(p-tolyl)-3-(trimethylsilyl)-1H-pyrazol-5-yl)ureido)naphthalen-1-yl)oxy)pyrimidin-2-yl)amino)benzamide | US9783556, Example 12
Type:
Small organic molecule
Emp. Form.:
C42H47N9O5Si
Mol. Mass.:
785.9654
SMILES:
COc1cc(Nc2nccc(Oc3ccc(NC(=O)Nc4cc(nn4-c4ccc(C)cc4)[Si](C)(C)C)c4ccccc34)n2)cc(c1)C(=O)NCCN1CCOCC1
: